Target
Muscarinic acetylcholine receptor M3
Ligand
BDBM50194643
Substrate
Meas. Tech.
ChEMBL_395698 (CHEMBL909206)
Ki
1.6±n/a nM
Citation
 Sagara, YSagara, TUchiyama, MOtsuki, SKimura, TFujikawa, TNoguchi, KOhtake, N Identification of a novel 4-aminomethylpiperidine class of M3 muscarinic receptor antagonists and structural insight into their M3 selectivity. J Med Chem 49:5653-63 (2006)  
Target
Name:
Muscarinic acetylcholine receptor M3
Synonyms:
ACM3_HUMAN Cholinergic, muscarinic M3 Muscarinic receptor M3 | RecName: Full=Muscarinic acetylcholine receptor M3
Type:
Enzyme
Mol. Mass.:
66151.03
Organism:
Homo sapiens (Human)
Description:
P20309
Residue:
590
  
Inhibitor
Name:
BDBM50194643
Synonyms:
(2R)-1-((2S,4R)-4-hydroxy-1-[3,3,3-tris(4-chlorophenyl)propanoyl]pyrrolidine-2-yl)carbonyl-N-((3R)-3-piperidinylmethyl)-pyrrolidine-2-carboxamide | CHEMBL215894
Type:
Small organic molecule
Emp. Form.:
C37H41Cl3N4O4
Mol. Mass.:
712.105
SMILES:
O[C@@H]1C[C@H](N(C1)C(=O)CC(c1ccc(Cl)cc1)(c1ccc(Cl)cc1)c1ccc(Cl)cc1)C(=O)N1CCC[C@@H]1C(=O)NC[C@@H]1CCCNC1
: