Target
Muscarinic acetylcholine receptor M1
Ligand
BDBM50194654
Substrate
Meas. Tech.
ChEMBL_395699 (CHEMBL909207)
Ki
93±n/a nM
Citation
 Sagara, YSagara, TUchiyama, MOtsuki, SKimura, TFujikawa, TNoguchi, KOhtake, N Identification of a novel 4-aminomethylpiperidine class of M3 muscarinic receptor antagonists and structural insight into their M3 selectivity. J Med Chem 49:5653-63 (2006)  
Target
Name:
Muscarinic acetylcholine receptor M1
Synonyms:
ACM1_HUMAN Cholinergic receptor, muscarinic 1 | Cholinergic, muscarinic M1
Type:
Protein
Mol. Mass.:
51442.54
Organism:
Homo sapiens (Human)
Description:
P11229
Residue:
460
  
Inhibitor
Name:
BDBM50194654
Synonyms:
(2R)-1-((2S,4R)-4-hydroxy-1-[3,3,3-tris(4-chlorophenyl)propanoyl]pyrrolidine-2-yl)carbonyl-N-(4-piperidinylmethyl)pyrrolidine-2-carboxamide | CHEMBL378872
Type:
Small organic molecule
Emp. Form.:
C37H41Cl3N4O4
Mol. Mass.:
712.105
SMILES:
O[C@@H]1C[C@H](N(C1)C(=O)CC(c1ccc(Cl)cc1)(c1ccc(Cl)cc1)c1ccc(Cl)cc1)C(=O)N1CCC[C@@H]1C(=O)NCC1CCNCC1
: