Target
Proto-oncogene tyrosine-protein kinase Src
Ligand
BDBM50194668
Substrate
Meas. Tech.
ChEMBL_396643 (CHEMBL871537)
IC50
2±n/a nM
Citation
 DiMauro, EFNewcomb, JNunes, JJBemis, JEBoucher, CBuchanan, JLBuckner, WHCee, VJChai, LDeak, HLEpstein, LFFaust, TGallant, PGeuns-Meyer, SDGore, AGu, YHenkle, BHodous, BLHsieh, FHuang, XKim, JLLee, JHMartin, MWMasse, CEMcGowan, DCMetz, DMohn, DMorgenstern, KAOliveira-dos-Santos, APatel, VFPowers, DRose, PESchneider, STomlinson, SATudor, YYTurci, SMWelcher, AAWhite, RDZhao, HZhu, LZhu, X Discovery of aminoquinazolines as potent, orally bioavailable inhibitors of Lck: synthesis, SAR, and in vivo anti-inflammatory activity. J Med Chem 49:5671-86 (2006)  
Target
Name:
Proto-oncogene tyrosine-protein kinase Src
Synonyms:
Calmodulin/Proto-oncogene tyrosine-protein kinase Src Proto-oncogene c-Src SRC SRC_HUMAN V-src sarcoma (Schmidt-Ruppin A-2) viral oncogene homolog (avian) p60-Src | pp60c-src
Type:
Protein
Mol. Mass.:
59838.60
Organism:
Homo sapiens (Human)
Description:
P12931
Residue:
536
  
Inhibitor
Name:
BDBM50194668
Synonyms:
4-methyl-3-(2-(2-morpholinoethylamino)quinazolin-6-yl)-N-(3-(trifluoromethyl)phenyl)benzamide | CHEMBL215943
Type:
Small organic molecule
Emp. Form.:
C29H28F3N5O2
Mol. Mass.:
535.5601
SMILES:
Cc1ccc(cc1-c1ccc2nc(NCCN3CCOCC3)ncc2c1)C(=O)Nc1cccc(c1)C(F)(F)F
: