Target
Mitogen-activated protein kinase 14
Ligand
BDBM50194672
Substrate
Meas. Tech.
ChEMBL_396625 (CHEMBL853498)
IC50
57±n/a nM
Citation
 DiMauro, EFNewcomb, JNunes, JJBemis, JEBoucher, CBuchanan, JLBuckner, WHCee, VJChai, LDeak, HLEpstein, LFFaust, TGallant, PGeuns-Meyer, SDGore, AGu, YHenkle, BHodous, BLHsieh, FHuang, XKim, JLLee, JHMartin, MWMasse, CEMcGowan, DCMetz, DMohn, DMorgenstern, KAOliveira-dos-Santos, APatel, VFPowers, DRose, PESchneider, STomlinson, SATudor, YYTurci, SMWelcher, AAWhite, RDZhao, HZhu, LZhu, X Discovery of aminoquinazolines as potent, orally bioavailable inhibitors of Lck: synthesis, SAR, and in vivo anti-inflammatory activity. J Med Chem 49:5671-86 (2006)  
Target
Name:
Mitogen-activated protein kinase 14
Synonyms:
CSAID-binding protein CSBP1 CSPB1 MAP kinase 14 MAP kinase p38 alpha MAPK14 MK14_HUMAN Mitogen-activated protein kinase p38 alpha Stress-activated protein kinase 2a | p38 MAP kinase alpha/beta
Type:
Serine/threonine-protein kinase
Mol. Mass.:
41286.76
Organism:
Homo sapiens (Human)
Description:
Q16539
Residue:
360
  
Inhibitor
Name:
BDBM50194672
Synonyms:
4-methyl-N-(2-methyl-3-(trifluoromethyl)phenyl)-3-(2-(phenylamino)quinazolin-6-yl)benzamide | CHEMBL215863
Type:
Small organic molecule
Emp. Form.:
C30H23F3N4O
Mol. Mass.:
512.525
SMILES:
Cc1ccc(cc1-c1ccc2nc(Nc3ccccc3)ncc2c1)C(=O)Nc1cccc(c1C)C(F)(F)F
: