Target
Vascular endothelial growth factor receptor 2
Ligand
BDBM50194682
Substrate
Meas. Tech.
ChEMBL_396624 (CHEMBL853495)
IC50
1438±n/a nM
Citation
 DiMauro, EFNewcomb, JNunes, JJBemis, JEBoucher, CBuchanan, JLBuckner, WHCee, VJChai, LDeak, HLEpstein, LFFaust, TGallant, PGeuns-Meyer, SDGore, AGu, YHenkle, BHodous, BLHsieh, FHuang, XKim, JLLee, JHMartin, MWMasse, CEMcGowan, DCMetz, DMohn, DMorgenstern, KAOliveira-dos-Santos, APatel, VFPowers, DRose, PESchneider, STomlinson, SATudor, YYTurci, SMWelcher, AAWhite, RDZhao, HZhu, LZhu, X Discovery of aminoquinazolines as potent, orally bioavailable inhibitors of Lck: synthesis, SAR, and in vivo anti-inflammatory activity. J Med Chem 49:5671-86 (2006)  
Target
Name:
Vascular endothelial growth factor receptor 2
Synonyms:
CD_antigen=CD309 Fetal liver kinase 1 (FLK-1) KDR Protein-tyrosine kinase receptor Flk-1 VEGFR-2 VEGFR2 Vascular Endothelial Growth Factor Receptor Kinase 2 Vascular endothelial growth factor receptor 2 (KDR) Vascular endothelial growth factor receptor 2 (VEGFR2) Vascular endothelial growth factor receptor-2 (VEGFR-2)
Type:
Receptor Tyrosine Kinase
Mol. Mass.:
151510.97
Organism:
Homo sapiens (Human)
Description:
P35968
Residue:
1356
  
Inhibitor
Name:
BDBM50194682
Synonyms:
CHEMBL213478 | N-methyl-6-(2-methyl-5-(5-(trifluoromethyl)-1Hbenzo[d]imidazol-2-ylamino)phenyl)quinazolin-2-amine
Type:
Small organic molecule
Emp. Form.:
C24H19F3N6
Mol. Mass.:
448.4431
SMILES:
CNc1ncc2cc(ccc2n1)-c1cc(Nc2nc3ccc(cc3[nH]2)C(F)(F)F)ccc1C
: