Target
Tyrosine-protein kinase JAK3
Ligand
BDBM50194686
Substrate
Meas. Tech.
ChEMBL_396626 (CHEMBL853499)
IC50
722±n/a nM
Citation
 DiMauro, EFNewcomb, JNunes, JJBemis, JEBoucher, CBuchanan, JLBuckner, WHCee, VJChai, LDeak, HLEpstein, LFFaust, TGallant, PGeuns-Meyer, SDGore, AGu, YHenkle, BHodous, BLHsieh, FHuang, XKim, JLLee, JHMartin, MWMasse, CEMcGowan, DCMetz, DMohn, DMorgenstern, KAOliveira-dos-Santos, APatel, VFPowers, DRose, PESchneider, STomlinson, SATudor, YYTurci, SMWelcher, AAWhite, RDZhao, HZhu, LZhu, X Discovery of aminoquinazolines as potent, orally bioavailable inhibitors of Lck: synthesis, SAR, and in vivo anti-inflammatory activity. J Med Chem 49:5671-86 (2006)  
Target
Name:
Tyrosine-protein kinase JAK3
Synonyms:
JAK-3 JAK3_HUMAN Janus kinase 3 (JAK3) L-JAK | Leukocyte janus kinase
Type:
Protein
Mol. Mass.:
125111.08
Organism:
Homo sapiens (Human)
Description:
P52333
Residue:
1124
  
Inhibitor
Name:
BDBM50194686
Synonyms:
1-(2-(4-methyl-3-(2-(methylamino)quinazolin-6-yl)benzamido)-4-(trifluoromethyl)phenyl)-3-(2-morpholinoethyl)urea | CHEMBL213831
Type:
Small organic molecule
Emp. Form.:
C31H32F3N7O3
Mol. Mass.:
607.6261
SMILES:
CNc1ncc2cc(ccc2n1)-c1cc(ccc1C)C(=O)Nc1cc(ccc1NC(=O)NCCN1CCOCC1)C(F)(F)F
: