Target
Glycogen phosphorylase, liver form
Ligand
BDBM50194701
Substrate
Meas. Tech.
ChEMBL_399836 (CHEMBL910311)
IC50
490±n/a nM
Citation
 Oikonomakos, NGTiraidis, CLeonidas, DDZographos, SEKristiansen, MJessen, CUNørskov-Lauritsen, LAgius, L Iminosugars as potential inhibitors of glycogenolysis: structural insights into the molecular basis of glycogen phosphorylase inhibition. J Med Chem 49:5687-701 (2006)  
Target
Name:
Glycogen phosphorylase, liver form
Synonyms:
Glycogen Phosphorylase (PYGL) Liver glycogen phosphorylase PYGL_HUMAN
Type:
Homodimer
Mol. Mass.:
97153.98
Organism:
Homo sapiens (Human)
Description:
Dimers associate into a tetramer to form the enzymatically active phosphorylase A.
Residue:
847
  
Inhibitor
Name:
BDBM50194701
Synonyms:
(2R,3R,4R)-2-Hydroxymethylpyrrolidin-3,4-diol hydrochloride | CHEMBL215137
Type:
Small organic molecule
Emp. Form.:
C5H12NO3
Mol. Mass.:
134.1531
SMILES:
OC[C@H]1[NH2+]C[C@@H](O)[C@@H]1O
: