Target
Alpha-2B adrenergic receptor
Ligand
BDBM50196113
Substrate
Meas. Tech.
ChEMBL_406589 (CHEMBL907693)
Ki
1280±n/a nM
Citation
 Höglund, IPSilver, SEngström, MTSalo, HTauber, AKyyrönen, HKSaarenketo, PHoffrén, AMKokko, KPohjanoksa, KSallinen, JSavola, JMWurster, SKallatsa, OA Structure-activity relationship of quinoline derivatives as potent and selective alpha(2C)-adrenoceptor antagonists. J Med Chem 49:6351-63 (2006)  
Target
Name:
Alpha-2B adrenergic receptor
Synonyms:
ADA2B_HUMAN ADRA2L1 Adrenergic alpha2B Adrenergic receptor alpha Alpha-2 adrenergic receptor subtype C2 Alpha-2B adrenoreceptor | Alpha-2BAR
Type:
Enzyme
Mol. Mass.:
49964.20
Organism:
Homo sapiens (Human)
Description:
P18089
Residue:
450
  
Inhibitor
Name:
BDBM50196113
Synonyms:
CHEMBL262901 | [4-(3,4-dimethylpiperazin-1-yl)phenyl]-(2,3,7-trimethylquinolin-4-yl)amine
Type:
Small organic molecule
Emp. Form.:
C24H30N4
Mol. Mass.:
374.5218
SMILES:
CC1CN(CCN1C)c1ccc(Nc2c(C)c(C)nc3cc(C)ccc23)cc1
: