Target
Alpha-2B adrenergic receptor
Ligand
BDBM50196111
Substrate
Meas. Tech.
ChEMBL_406589 (CHEMBL907693)
Ki
2500±n/a nM
Citation
 Höglund, IPSilver, SEngström, MTSalo, HTauber, AKyyrönen, HKSaarenketo, PHoffrén, AMKokko, KPohjanoksa, KSallinen, JSavola, JMWurster, SKallatsa, OA Structure-activity relationship of quinoline derivatives as potent and selective alpha(2C)-adrenoceptor antagonists. J Med Chem 49:6351-63 (2006)  
Target
Name:
Alpha-2B adrenergic receptor
Synonyms:
ADA2B_HUMAN ADRA2L1 Adrenergic alpha2B Adrenergic receptor alpha Alpha-2 adrenergic receptor subtype C2 Alpha-2B adrenoreceptor | Alpha-2BAR
Type:
Enzyme
Mol. Mass.:
49964.20
Organism:
Homo sapiens (Human)
Description:
P18089
Residue:
450
  
Inhibitor
Name:
BDBM50196111
Synonyms:
4-(3-methyltetrahydropyrimidin-1(2H)-yl)phenyl]-(2,3,8-trimethylquinolin-4-yl)amine | CHEMBL216072
Type:
Small organic molecule
Emp. Form.:
C23H28N4
Mol. Mass.:
360.4952
SMILES:
CN1CCCN(C1)c1ccc(Nc2c(C)c(C)nc3c(C)cccc23)cc1
: