Target
Alpha-2C adrenergic receptor
Ligand
BDBM50196109
Substrate
Meas. Tech.
ChEMBL_406590 (CHEMBL907694)
Ki
2.3±n/a nM
Citation
 Höglund, IPSilver, SEngström, MTSalo, HTauber, AKyyrönen, HKSaarenketo, PHoffrén, AMKokko, KPohjanoksa, KSallinen, JSavola, JMWurster, SKallatsa, OA Structure-activity relationship of quinoline derivatives as potent and selective alpha(2C)-adrenoceptor antagonists. J Med Chem 49:6351-63 (2006)  
Target
Name:
Alpha-2C adrenergic receptor
Synonyms:
ADA2C_HUMAN ADRA2L2 Adrenergic alpha2C Adrenergic receptor alpha Alpha-2 adrenergic receptor subtype C4 Alpha-2C adrenoreceptor | adrenergic, alpha-2C-, receptor [Homo sapiens]
Type:
Enzyme
Mol. Mass.:
49552.32
Organism:
Homo sapiens (Human)
Description:
P18825
Residue:
462
  
Inhibitor
Name:
BDBM50196109
Synonyms:
(2,3-dimethylquinolin-4-yl)-[4-(octahydro-2H-pyrido[1,2-a]-pyrazin-2-yl)phenyl]amine | CHEMBL425983
Type:
Small organic molecule
Emp. Form.:
C25H30N4
Mol. Mass.:
386.5325
SMILES:
Cc1nc2ccccc2c(Nc2ccc(cc2)N2CCN3CCCCC3C2)c1C
: