Target
Alpha-2C adrenergic receptor
Ligand
BDBM50196135
Substrate
Meas. Tech.
ChEMBL_406590 (CHEMBL907694)
Ki
28±n/a nM
Citation
 Höglund, IPSilver, SEngström, MTSalo, HTauber, AKyyrönen, HKSaarenketo, PHoffrén, AMKokko, KPohjanoksa, KSallinen, JSavola, JMWurster, SKallatsa, OA Structure-activity relationship of quinoline derivatives as potent and selective alpha(2C)-adrenoceptor antagonists. J Med Chem 49:6351-63 (2006)  
Target
Name:
Alpha-2C adrenergic receptor
Synonyms:
ADA2C_HUMAN ADRA2L2 Adrenergic alpha2C Adrenergic receptor alpha Alpha-2 adrenergic receptor subtype C4 Alpha-2C adrenoreceptor | adrenergic, alpha-2C-, receptor [Homo sapiens]
Type:
Enzyme
Mol. Mass.:
49552.32
Organism:
Homo sapiens (Human)
Description:
P18825
Residue:
462
  
Inhibitor
Name:
BDBM50196135
Synonyms:
Acridin-9-yl-[4-(4-methyl-piperazin-1-yl)-phenyl]-amine GNF-Pf-3427 TCMDC-123912
Type:
Small organic molecule
Emp. Form.:
C24H24N4
Mol. Mass.:
368.4742
SMILES:
CN1CCN(CC1)c1ccc(Nc2c3ccccc3nc3ccccc23)cc1
: