Target
Alpha-2A adrenergic receptor
Ligand
BDBM50196145
Substrate
Meas. Tech.
ChEMBL_406588 (CHEMBL856624)
Ki
790±n/a nM
Citation
 Höglund, IPSilver, SEngström, MTSalo, HTauber, AKyyrönen, HKSaarenketo, PHoffrén, AMKokko, KPohjanoksa, KSallinen, JSavola, JMWurster, SKallatsa, OA Structure-activity relationship of quinoline derivatives as potent and selective alpha(2C)-adrenoceptor antagonists. J Med Chem 49:6351-63 (2006)  
Target
Name:
Alpha-2A adrenergic receptor
Synonyms:
ADA2A_HUMAN ADRA2R Adrenergic alpha2A Alpha-2 adrenergic receptor subtype C10 Alpha-2A adrenoreceptor alpha-2A adrenergic receptor [Homo sapiens]
Type:
Enzyme
Mol. Mass.:
48979.91
Organism:
Homo sapiens (Human)
Description:
P08913
Residue:
450
  
Inhibitor
Name:
BDBM50196145
Synonyms:
(R)-[4-(3,4-dimethylpiperazin-1-yl)phenyl]-(2,3,7,8-tetramethylquinolin-4-yl)amine | CHEMBL217567
Type:
Small organic molecule
Emp. Form.:
C25H32N4
Mol. Mass.:
388.5484
SMILES:
C[C@@H]1CN(CCN1C)c1ccc(Nc2c(C)c(C)nc3c(C)c(C)ccc23)cc1
: