Target
Alpha-2A adrenergic receptor
Ligand
BDBM50196129
Substrate
Meas. Tech.
ChEMBL_406588 (CHEMBL856624)
Ki
3100±n/a nM
Citation
 Höglund, IPSilver, SEngström, MTSalo, HTauber, AKyyrönen, HKSaarenketo, PHoffrén, AMKokko, KPohjanoksa, KSallinen, JSavola, JMWurster, SKallatsa, OA Structure-activity relationship of quinoline derivatives as potent and selective alpha(2C)-adrenoceptor antagonists. J Med Chem 49:6351-63 (2006)  
Target
Name:
Alpha-2A adrenergic receptor
Synonyms:
ADA2A_HUMAN ADRA2R Adrenergic alpha2A Alpha-2 adrenergic receptor subtype C10 Alpha-2A adrenoreceptor alpha-2A adrenergic receptor [Homo sapiens]
Type:
Enzyme
Mol. Mass.:
48979.91
Organism:
Homo sapiens (Human)
Description:
P08913
Residue:
450
  
Inhibitor
Name:
BDBM50196129
Synonyms:
CHEMBL214996 | {4-[4-(3,4-dimethylpiperazin-1-yl)phenylamino]-2-methylquinolin-3-yl}methanol
Type:
Small organic molecule
Emp. Form.:
C23H28N4O
Mol. Mass.:
376.4946
SMILES:
CC1CN(CCN1C)c1ccc(Nc2c(CO)c(C)nc3ccccc23)cc1
: