Target
Thyrotropin-releasing hormone receptor
Ligand
BDBM50196451
Substrate
Meas. Tech.
ChEMBL_431932 (CHEMBL917827)
Ki
13±n/a nM
Citation
 Kaur, NMonga, VLu, XGershengorn, MCJain, R Modifications of the pyroglutamic acid and histidine residues in thyrotropin-releasing hormone (TRH) yield analogs with selectivity for TRH receptor type 2 over type 1. Bioorg Med Chem 15:433-43 (2006)  
Target
Name:
Thyrotropin-releasing hormone receptor
Synonyms:
Thyrotropin-releasing hormone receptor 2
Type:
PROTEIN
Mol. Mass.:
39044.21
Organism:
Rattus norvegicus
Description:
ChEMBL_532304
Residue:
352
  
Inhibitor
Name:
BDBM50196451
Synonyms:
(2S)-1-{(2S)-3-(1-methyl-1H-4-imidazolyl)-2-[(2S)-6-oxohexahydro-2-pyridinylcarboxamido]propanoyl}azolane-2-carboxamide | CHEMBL223972
Type:
Small organic molecule
Emp. Form.:
C18H26N6O4
Mol. Mass.:
390.4368
SMILES:
Cn1cnc(C[C@H](NC(=O)[C@@H]2CCCC(=O)N2)C(=O)N2CCC[C@H]2C(N)=O)c1
: