Target
Thyrotropin-releasing hormone receptor
Ligand
BDBM50196446
Substrate
Meas. Tech.
ChEMBL_431931 (CHEMBL917826)
Ki
3±n/a nM
Citation
 Kaur, NMonga, VLu, XGershengorn, MCJain, R Modifications of the pyroglutamic acid and histidine residues in thyrotropin-releasing hormone (TRH) yield analogs with selectivity for TRH receptor type 2 over type 1. Bioorg Med Chem 15:433-43 (2006)  
Target
Name:
Thyrotropin-releasing hormone receptor
Synonyms:
TRFR_HUMAN TRHR | Thyroliberin receptor
Type:
PROTEIN
Mol. Mass.:
45093.48
Organism:
Homo sapiens (Human)
Description:
ChEMBL_431933
Residue:
398
  
Inhibitor
Name:
BDBM50196446
Synonyms:
CHEMBL224730 | [N tau(1)-Me-His]-TRH
Type:
Small organic molecule
Emp. Form.:
C23H32N9O5
Mol. Mass.:
514.5569
SMILES:
C[n+]1c[nH]cc1C[C@H](N)C(=O)N1[C@@H](CCC1=O)C(=O)N[C@@H](Cc1cnc[nH]1)C(=O)N1CCC[C@H]1C(N)=O
: