Target
Thyrotropin-releasing hormone receptor
Ligand
BDBM50196461
Substrate
Meas. Tech.
ChEMBL_431931 (CHEMBL917826)
Ki
>100000±n/a nM
Citation
 Kaur, NMonga, VLu, XGershengorn, MCJain, R Modifications of the pyroglutamic acid and histidine residues in thyrotropin-releasing hormone (TRH) yield analogs with selectivity for TRH receptor type 2 over type 1. Bioorg Med Chem 15:433-43 (2006)  
Target
Name:
Thyrotropin-releasing hormone receptor
Synonyms:
TRFR_HUMAN TRHR | Thyroliberin receptor
Type:
PROTEIN
Mol. Mass.:
45093.48
Organism:
Homo sapiens (Human)
Description:
ChEMBL_431933
Residue:
398
  
Inhibitor
Name:
BDBM50196461
Synonyms:
(2S)-1-[(2S)-2-(1R)-3-oxocyclopentylcarboxamido]-3-(2-tert-butyl-1H-imidazolyl)propanoyl]azalone-2-carboxamide | CHEMBL389858
Type:
Small organic molecule
Emp. Form.:
C21H31N5O4
Mol. Mass.:
417.5019
SMILES:
CC(C)(C)c1ncc(C[C@H](NC(=O)[C@@H]2CCC(=O)C2)C(=O)N2CCC[C@H]2C(N)=O)[nH]1
: