Target
Cathepsin B
Ligand
BDBM50196731
Substrate
Meas. Tech.
ChEMBL_440732 (CHEMBL889829)
IC50
446±n/a nM
Citation
 Freskos, JNFobian, YMBenson, TEMoon, JBBienkowski, MJBrown, DLEmmons, TLHeintz, RLaborde, AMcDonald, JJMischke, BVMolyneaux, JMMullins, PBBryan Prince, DPaddock, DJTomasselli, AGWinterrowd, G Design of potent inhibitors of human beta-secretase. Part 2. Bioorg Med Chem Lett 17:78-81 (2006)  
Target
Name:
Cathepsin B
Synonyms:
APP secretase CATB_HUMAN CTSB Cathepsin B light chain | Cathepsin B1
Type:
Enzyme
Mol. Mass.:
37819.69
Organism:
Homo sapiens (Human)
Description:
gi_63102437
Residue:
339
  
Inhibitor
Name:
BDBM50196731
Synonyms:
CHEMBL231669 | N-{(S)-2-(butane-1-sulfonyl)-1-[(1S,2R)-1-(3,5-difluoro-benzyl)-3-(3-ethyl-benzylamino)-2-hydroxy-propylcarbamoyl]-ethyl}-isobutyramide
Type:
Small organic molecule
Emp. Form.:
C30H41F2N3O5S
Mol. Mass.:
593.725
SMILES:
CCCCS(=O)(=O)C[C@@H](NC(=O)C1CC1)C(=O)N[C@@H](Cc1cc(F)cc(F)c1)[C@H](O)CNCc1cccc(CC)c1
: