Target
Neuropeptide Y receptor type 2
Ligand
BDBM50197014
Substrate
Meas. Tech.
ChEMBL_453177 (CHEMBL902327)
Ki
75±n/a nM
Citation
 DeCarr, LBBuckholz, TMCoish, PDFathi, ZFisk, SEMays, MRO'Connor, SJLumb, KJ Identification of selective neuropeptide Y2 peptide agonists. Bioorg Med Chem Lett 17:538-41 (2007)  
Target
Name:
Neuropeptide Y receptor type 2
Synonyms:
NPY-Y2 NPY2-R NPY2R_HUMAN Y2 receptor | neuropeptide Y receptor Y2
Type:
Enzyme Catalytic Domain
Mol. Mass.:
42734.65
Organism:
Homo sapiens (Human)
Description:
NPY-Y2 NPY2R HUMAN::P49146
Residue:
381
  
Inhibitor
Name:
BDBM50197014
Synonyms:
AcNPY(25-36) | CHEMBL411793
Type:
Small organic molecule
Emp. Form.:
C76H119N27O18
Mol. Mass.:
1698.9282
SMILES:
CC[C@@H](C)[C@@H]1NC(=O)[C@H](CC(C)C)NC(=O)[C@H](CC(N)=O)NC(=O)[C@H](CCCCNC(=O)CC[C@H](NC1=O)C(=O)N[C@@H](CCCN=C(N)N)C(=O)N[C@@H](CCC(N)=O)C(=O)N[C@@H](CCCN=C(N)N)C(=O)N[C@@H](Cc1ccc(O)cc1)C(N)=O)NC(=O)[C@H](Cc1ccc(O)cc1)NC(=O)[C@H](Cc1cnc[nH]1)NC(=O)[C@H](CCCN=C(N)N)NC(C)=O
: