Target
Disintegrin and metalloproteinase domain-containing protein 17
Ligand
BDBM50197215
Substrate
Meas. Tech.
ChEMBL_440759 (CHEMBL889856)
IC50
<1±n/a nM
Citation
 Condon, JSJoseph-McCarthy, DLevin, JILombart, HGLovering, FESun, LWang, WXu, WZhang, Y Identification of potent and selective TACE inhibitors via the S1 pocket. Bioorg Med Chem Lett 17:34-9 (2006)  
Target
Name:
Disintegrin and metalloproteinase domain-containing protein 17
Synonyms:
ADA17_HUMAN CSVP Disintegrin and metalloproteinase domain-containing protein 17 (ADAM17) TNF-alpha convertase TNF-alpha-converting enzyme (TACE) Tumor necrosis factor-α converting enzyme (TACE)
Type:
Enzyme
Mol. Mass.:
93007.89
Organism:
Homo sapiens (Human)
Description:
Residue:
824
  
Inhibitor
Name:
BDBM50197215
Synonyms:
4-((4-(but-2-ynyloxy)phenylsulfonyl)methyl)-1-(cyclohexylmethylsulfonyl)-N-hydroxypiperidine-4-carboxamide | CHEMBL234143
Type:
Small organic molecule
Emp. Form.:
C24H34N2O7S2
Mol. Mass.:
526.666
SMILES:
CC#CCOc1ccc(cc1)S(=O)(=O)CC1(CCN(CC1)S(=O)(=O)CC1CCCCC1)C(=O)NO
: