Target
Disintegrin and metalloproteinase domain-containing protein 17
Ligand
BDBM50197237
Substrate
Meas. Tech.
ChEMBL_440768 (CHEMBL889865)
IC50
1.5±n/a nM
Citation
 Condon, JSJoseph-McCarthy, DLevin, JILombart, HGLovering, FESun, LWang, WXu, WZhang, Y Identification of potent and selective TACE inhibitors via the S1 pocket. Bioorg Med Chem Lett 17:34-9 (2006)  
Target
Name:
Disintegrin and metalloproteinase domain-containing protein 17
Synonyms:
ADA17_HUMAN CSVP Disintegrin and metalloproteinase domain-containing protein 17 (ADAM17) TNF-alpha convertase TNF-alpha-converting enzyme (TACE) Tumor necrosis factor-α converting enzyme (TACE)
Type:
Enzyme
Mol. Mass.:
93007.89
Organism:
Homo sapiens (Human)
Description:
Residue:
824
  
Inhibitor
Name:
BDBM50197237
Synonyms:
1-(4-acetylpiperazin-1-ylsulfonyl)-4-((4-(but-2-ynyloxy)phenylsulfonyl)methyl)-N-hydroxypiperidine-4-carboxamide | CHEMBL231877
Type:
Small organic molecule
Emp. Form.:
C23H32N4O8S2
Mol. Mass.:
556.652
SMILES:
CC#CCOc1ccc(cc1)S(=O)(=O)CC1(CCN(CC1)S(=O)(=O)N1CCN(CC1)C(C)=O)C(=O)NO
: