Target
Metabotropic glutamate receptor 1
Ligand
BDBM50197275
Substrate
Meas. Tech.
ChEMBL_453190 (CHEMBL902340)
Ki
2±n/a nM
Citation
 Owen, DRDodd, PGGayton, SGreener, BSHarbottle, GWMantell, SJMaw, GNOsborne, SARees, HRinger, TJRodriguez-Lens, MSmith, GF Structure-activity relationships of novel non-competitive mGluR1 antagonists: a potential treatment for chronic pain. Bioorg Med Chem Lett 17:486-90 (2007)  
Target
Name:
Metabotropic glutamate receptor 1
Synonyms:
GRM1_RAT Grm1 Metabotropic glutamate receptor Mglur1 metabotropic glutamate 1/5-D metabotropic glutamate receptor 1 isoform alpha precursor
Type:
Enzyme Catalytic Domain
Mol. Mass.:
133240.47
Organism:
RAT
Description:
metabotropic glutamate 1/2 0 RAT::P23385
Residue:
1199
  
Inhibitor
Name:
BDBM50197275
Synonyms:
CHEMBL246023 | N-(2-(4-fluorophenyl)-2-methylpropyl)quinoxaline-2-carboxamide
Type:
Small organic molecule
Emp. Form.:
C19H18FN3O
Mol. Mass.:
323.3641
SMILES:
CC(C)(CNC(=O)c1cnc2ccccc2n1)c1ccc(F)cc1
: