Target
Aminopeptidase N
Ligand
BDBM50197498
Substrate
Meas. Tech.
ChEMBL_432259 (CHEMBL914037)
IC50
82±n/a nM
Citation
 Flipo, MBeghyn, TCharton, JLeroux, VADeprez, BPDeprez-Poulain, RF A library of novel hydroxamic acids targeting the metallo-protease family: design, parallel synthesis and screening. Bioorg Med Chem 15:63-76 (2006)  
Target
Name:
Aminopeptidase N
Synonyms:
AMPN_PIG AP-M Alanyl aminopeptidase Aminopeptidase N (APN) Microsomal aminopeptidase pAPN
Type:
Protein
Mol. Mass.:
108810.25
Organism:
Sus scrofa (Pig)
Description:
P15145
Residue:
963
  
Inhibitor
Name:
BDBM50197498
Synonyms:
CHEMBL220311 N1-hydroxy-2-isobutyl-N3-(4-phenylbutyl)malonamide
Type:
Small organic molecule
Emp. Form.:
C17H26N2O3
Mol. Mass.:
306.3999
SMILES:
CC(C)CC(C(=O)NO)C(=O)NCCCCc1ccccc1
: