Target
Interstitial collagenase
Ligand
BDBM12072
Substrate
Meas. Tech.
ChEMBL_432502 (CHEMBL918796)
IC50
150±n/a nM
Citation
 Biasone, ATortorella, PCampestre, CAgamennone, MPreziuso, SChiappini, MNuti, ECarelli, PRossello, AMazza, FGallina, C alpha-Biphenylsulfonylamino 2-methylpropyl phosphonates: enantioselective synthesis and selective inhibition of MMPs. Bioorg Med Chem 15:791-9 (2006)  
Target
Name:
Interstitial collagenase
Synonyms:
CLG MMP1 Matrix metalloproteinase-1 | Matrix metalloproteinase-1 (MMP-1)
Type:
Enzyme
Mol. Mass.:
54010.26
Organism:
Homo sapiens (Human)
Description:
P03956
Residue:
469
  
Inhibitor
Name:
BDBM12072
Synonyms:
(R)-[1-(4-Methoxybiphenyl-4-sulfonylamino)-2-methylpropyl]phosphonic Acid [(1R)-1-{[4-(4-methoxyphenyl)benzene]sulfonamido}-2-methylpropyl]phosphonic acid | alpha-arylsulfonylamino phosphonate 1R
Type:
Small organic molecule
Emp. Form.:
C17H22NO6PS
Mol. Mass.:
399.398
SMILES:
COc1ccc(cc1)-c1ccc(cc1)S(=O)(=O)N[C@@H](C(C)C)P(O)(O)=O
: