Target
Interstitial collagenase
Ligand
BDBM50198039
Substrate
Meas. Tech.
ChEMBL_432502 (CHEMBL918796)
IC50
160±n/a nM
Citation
 Biasone, ATortorella, PCampestre, CAgamennone, MPreziuso, SChiappini, MNuti, ECarelli, PRossello, AMazza, FGallina, C alpha-Biphenylsulfonylamino 2-methylpropyl phosphonates: enantioselective synthesis and selective inhibition of MMPs. Bioorg Med Chem 15:791-9 (2006)  
Target
Name:
Interstitial collagenase
Synonyms:
CLG MMP1 Matrix metalloproteinase-1 | Matrix metalloproteinase-1 (MMP-1)
Type:
Enzyme
Mol. Mass.:
54010.26
Organism:
Homo sapiens (Human)
Description:
P03956
Residue:
469
  
Inhibitor
Name:
BDBM50198039
Synonyms:
CHEMBL374377 | [(R)-1-(4'-fluoro-biphenyl-4-sulfonylamino)-2-methyl-propyl]-phosphonic acid
Type:
Small organic molecule
Emp. Form.:
C16H19FNO5PS
Mol. Mass.:
387.363
SMILES:
CC(C)[C@H](NS(=O)(=O)c1ccc(cc1)-c1ccc(F)cc1)P(O)(O)=O
: