Target
Melanin-concentrating hormone receptor 1
Ligand
BDBM50199241
Substrate
Meas. Tech.
ChEMBL_411945 (CHEMBL908393)
IC50
5.6±n/a nM
Citation
 Tavares, FXAl-Barazanji, KABigham, ECBishop, MJBritt, CSCarlton, DLFeldman, PLGoetz, ASGrizzle, MKGuo, YCHandlon, ALHertzog, DLIgnar, DMLang, DGOtt, RJPeat, AJZhou, HQ Potent, selective, and orally efficacious antagonists of melanin-concentrating hormone receptor 1. J Med Chem 49:7095-107 (2006)  
Target
Name:
Melanin-concentrating hormone receptor 1
Synonyms:
G-protein coupled receptor 24 MCH receptor 1 MCH-R1 MCHR-1 MCHR1_HUMAN Melanin-Concentrating Hormone Receptor 1 (MCH1R) Melanin-concentrating hormone receptor 1 (MCH-1) Melanin-concentrating hormone receptor 1 (MCHR-1) SLC-1 Somatostatin receptor-like protein
Type:
G Protein-Coupled Receptor (GPCR)
Mol. Mass.:
45976.27
Organism:
Homo sapiens (Human)
Description:
Membranes from CHO-K1 cells stably expressing human MCH1R were used in assays.
Residue:
422
  
Inhibitor
Name:
BDBM50199241
Synonyms:
6-(4-chlorophenyl)-3-(2-{[4-(1-pyrrolidinyl)-1-piperidinyl]-methyl}-6-quinolinyl)thieno[3,2-d]pyrimidin-4(3H)-one | CHEMBL217812
Type:
Small organic molecule
Emp. Form.:
C31H30ClN5OS
Mol. Mass.:
556.121
SMILES:
Clc1ccc(cc1)-c1cc2ncn(-c3ccc4nc(CN5CCC(CC5)N5CCCC5)ccc4c3)c(=O)c2s1
: