Target
Adenosine receptor A1
Ligand
BDBM50199288
Substrate
Meas. Tech.
ChEMBL_412723 (CHEMBL910010)
Ki
23±n/a nM
Citation
 Kiesman, WFZhao, JConlon, PRDowling, JEPetter, RCLutterodt, FJin, XSmits, GFure, MJayaraj, AKim, JSullivan, GLinden, J Potent and orally bioavailable 8-bicyclo[2.2.2]octylxanthines as adenosine A1 receptor antagonists. J Med Chem 49:7119-31 (2006)  
Target
Name:
Adenosine receptor A1
Synonyms:
AA1R_RAT ADENOSINE A1 high Adenosine A1 receptor (A1) Adenosine receptors A1 | Adora1
Type:
Protein
Mol. Mass.:
36704.13
Organism:
Rattus norvegicus (rat)
Description:
Residue:
326
  
Inhibitor
Name:
BDBM50199288
Synonyms:
CHEMBL425457 | [4-(2,6-dioxo-1,3-dipropyl-2,3,6,9-tetrahydro-1H-purin-8-yl)-bicyclo[2.2.2]oct-1-yl]-acetic acid
Type:
Small organic molecule
Emp. Form.:
C21H30N4O4
Mol. Mass.:
402.4873
SMILES:
CCCn1c2nc([nH]c2c(=O)n(CCC)c1=O)[C@]12CC[C@](CC(O)=O)(CC1)CC2
: