Target
Adenosine receptor A1
Ligand
BDBM50199270
Substrate
Meas. Tech.
ChEMBL_412713 (CHEMBL908372)
Ki
12±n/a nM
Citation
 Kiesman, WFZhao, JConlon, PRDowling, JEPetter, RCLutterodt, FJin, XSmits, GFure, MJayaraj, AKim, JSullivan, GLinden, J Potent and orally bioavailable 8-bicyclo[2.2.2]octylxanthines as adenosine A1 receptor antagonists. J Med Chem 49:7119-31 (2006)  
Target
Name:
Adenosine receptor A1
Synonyms:
A1 adenosine receptor (hA1) AA1R_HUMAN ADORA1 Adenosine A1-receptor Adenosine receptor A1 (hA1) | Adenosine transporter (AdT)
Type:
G Protein-Coupled Receptor (GPCR)
Mol. Mass.:
36520.92
Organism:
Homo sapiens (Human)
Description:
P30542
Residue:
326
  
Inhibitor
Name:
BDBM50199270
Synonyms:
1,3-dipropyl-8-[2-(5,6-exo-epoxy-(1S,2S)-norborn-2-yl)]-xanthine | CHEMBL216750
Type:
Small organic molecule
Emp. Form.:
C18H24N4O3
Mol. Mass.:
344.4082
SMILES:
CCCn1c2nc([nH]c2c(=O)n(CCC)c1=O)[C@H]1CC2C[C@@H]1[C@H]1O[C@@H]21
: