Target
Adenosine receptor A2a
Ligand
BDBM50199289
Substrate
Meas. Tech.
ChEMBL_412200 (CHEMBL908403)
Ki
2700±n/a nM
Citation
 Vu, CBKiesman, WFConlon, PRLin, KCTam, MPetter, RCSmits, GLutterodt, FJin, XChen, LZhang, J Tricyclic imidazoline derivatives as potent and selective adenosine A1 receptor antagonists. J Med Chem 49:7132-9 (2006)  
Target
Name:
Adenosine receptor A2a
Synonyms:
AA2AR_RAT Adenosine A2 receptor Adenosine Receptors A2a (A2a) Adenosine receptors A2a Rat striatal adenosine A2a receptor
Type:
G Protein-Coupled Receptor (GPCR)
Mol. Mass.:
45015.65
Organism:
Rattus norvegicus (rat)
Description:
Rat A2A receptors expressed in CHO cells.
Residue:
410
  
Inhibitor
Name:
BDBM50199289
Synonyms:
(R)-8-ethyl-2-(4-hydroxybicyclo[2.2.2]octan-1-yl)-4-propyl-7,8-dihydro-1H-imidazo[1,2-g]purin-5(4H)-one | CHEMBL450341
Type:
Small organic molecule
Emp. Form.:
C20H29N5O2
Mol. Mass.:
371.4766
SMILES:
CCCn1c2nc(nc2c2N[C@H](CC)Cn2c1=O)C12CCC(O)(CC1)CC2
: