Target
Adenosine receptor A1
Ligand
BDBM50199294
Substrate
Meas. Tech.
ChEMBL_412202 (CHEMBL910041)
Ki
60±n/a nM
Citation
 Vu, CBKiesman, WFConlon, PRLin, KCTam, MPetter, RCSmits, GLutterodt, FJin, XChen, LZhang, J Tricyclic imidazoline derivatives as potent and selective adenosine A1 receptor antagonists. J Med Chem 49:7132-9 (2006)  
Target
Name:
Adenosine receptor A1
Synonyms:
A1 adenosine receptor (hA1) AA1R_HUMAN ADORA1 Adenosine A1-receptor Adenosine receptor A1 (hA1) | Adenosine transporter (AdT)
Type:
G Protein-Coupled Receptor (GPCR)
Mol. Mass.:
36520.92
Organism:
Homo sapiens (Human)
Description:
P30542
Residue:
326
  
Inhibitor
Name:
BDBM50199294
Synonyms:
(R)-2-(4-hydroxybicyclo[2.2.2]octan-1-yl)-8-methyl-4-propyl-7,8-dihydro-1H-imidazo[1,2-g]purin-5(4H)-one | CHEMBL384279
Type:
Small organic molecule
Emp. Form.:
C19H27N5O2
Mol. Mass.:
357.45
SMILES:
CCCn1c2nc(nc2c2N[C@H](C)Cn2c1=O)C12CCC(O)(CC1)CC2
: