Target
Voltage-dependent N-type calcium channel subunit alpha-1B
Ligand
BDBM50199825
Substrate
Meas. Tech.
ChEMBL_441127 (CHEMBL891341)
IC50
530±n/a nM
Citation
 Knutsen, LJHobbs, CJEarnshaw, CGFiumana, AGilbert, JMellor, SLRadford, FSmith, NJBirch, PJRussell Burley, JWard, SDJames, IF Synthesis and SAR of novel 2-arylthiazolidinones as selective analgesic N-type calcium channel blockers. Bioorg Med Chem Lett 17:662-7 (2007)  
Target
Name:
Voltage-dependent N-type calcium channel subunit alpha-1B
Synonyms:
BIII CAC1B_HUMAN CACNA1B Calcium channel (Type N) Voltage-dependent N-type calcium channel subunit alpha-1B Voltage-gated N-type calcium channel alpha-1B subunit Voltage-gated calcium channel Voltage-gated calcium channel subunit alpha Cav2.2 ((alpha 1B, beta 1b, alpha 2 delta-1) | calcium channel, voltage-dependent, N type, alpha 1B subunit
Type:
Enzyme
Mol. Mass.:
262548.16
Organism:
Homo sapiens (Human)
Description:
Q00975
Residue:
2339
  
Inhibitor
Name:
BDBM50199825
Synonyms:
3-isobutyl-2-(3-(4-vinylphenyl)pyridin-4-yl)thiazolidin-4-one | CHEMBL234915
Type:
Small organic molecule
Emp. Form.:
C20H22N2OS
Mol. Mass.:
338.466
SMILES:
CC(C)CN1C(SCC1=O)c1ccncc1-c1ccc(C=C)cc1
: