Target
D(4) dopamine receptor
Ligand
BDBM50200029
Substrate
Meas. Tech.
ChEMBL_422467 (CHEMBL910419)
EC50
5±n/a nM
Citation
 Patel, MVKolasa, TMortell, KMatulenko, MAHakeem, AARohde, JJNelson, SLCowart, MDNakane, MMiller, LNUchic, METerranova, MAEl-Kouhen, OFDonnelly-Roberts, DLNamovic, MTHollingsworth, PRChang, RMartino, BRWetter, JMMarsh, KCMartin, RDarbyshire, JFGintant, GHsieh, GCMoreland, RBSullivan, JPBrioni, JDStewart, AO Discovery of 3-methyl-N-(1-oxy-3',4',5',6'-tetrahydro-2'H-[2,4'-bipyridine]-1'-ylmethyl)benzamide (ABT-670), an orally bioavailable dopamine D4 agonist for the treatment of erectile dysfunction. J Med Chem 49:7450-65 (2006)  
Target
Name:
D(4) dopamine receptor
Synonyms:
D(2C) dopamine receptor DOPAMINE D4.2 DRD4 Dopamine D4 receptor
Type:
Enzyme
Mol. Mass.:
48373.19
Organism:
Homo sapiens (Human)
Description:
P21917
Residue:
419
  
Inhibitor
Name:
BDBM50200029
Synonyms:
6-(4-((1H-benzo[d]imidazol-2-yl)methyl)piperazin-1-yl)pyridin-3-ol CHEMBL219179
Type:
Small organic molecule
Emp. Form.:
C17H19N5O
Mol. Mass.:
309.3657
SMILES:
Oc1ccc(nc1)N1CCN(Cc2nc3ccccc3[nH]2)CC1
: