Target
Tyrosine-protein kinase CSK
Ligand
BDBM50200201
Substrate
Meas. Tech.
ChEMBL_422673 (CHEMBL913341)
IC50
6100±n/a nM
Citation
 Gu, XWang, YKumar, AYe, GParang, KSun, G Design and evaluation of hydroxamate derivatives as metal-mediated inhibitors of a protein tyrosine kinase. J Med Chem 49:7532-9 (2006)  
Target
Name:
Tyrosine-protein kinase CSK
Synonyms:
C-SRC kinase CSK Protein-tyrosine kinase CYL | Tyrosine Kinase CSK
Type:
Tyrosine-protein kinase
Mol. Mass.:
50707.30
Organism:
Homo sapiens (Human)
Description:
P41240
Residue:
450
  
Inhibitor
Name:
BDBM50200201
Synonyms:
(S)-2-amino-N-hydroxy-3-[3-(nitrophenyl)phenyl]propanamide | CHEMBL219552
Type:
Small organic molecule
Emp. Form.:
C15H15N3O4
Mol. Mass.:
301.2973
SMILES:
N[C@@H](Cc1ccc(cc1)-c1cccc(c1)[N+]([O-])=O)C(=O)NO
: