Target
Caspase-3
Ligand
BDBM50192784
Substrate
Meas. Tech.
ChEMBL_408842 (CHEMBL909966)
IC50
0.3±n/a nM
Citation
 Kopka, KFaust, AKeul, PWagner, SBreyholz, HJHöltke, CSchober, OSchäfers, MLevkau, B 5-pyrrolidinylsulfonyl isatins as a potential tool for the molecular imaging of caspases in apoptosis. J Med Chem 49:6704-15 (2006)  
Target
Name:
Caspase-3
Synonyms:
Apopain CASP3 CPP-32 Caspase 3 Caspase-3 subunit p17 SCA-1 Yama protein | caspase-3 preproprotein
Type:
Hydrolase; heterotetramer of two heterodimers
Mol. Mass.:
31607.55
Organism:
Homo sapiens (Human)
Description:
Residue:
277
  
Inhibitor
Name:
BDBM50192784
Synonyms:
(S)-1-(4-(2-fluoroethoxy)benzyl)-5-(2-(phenoxymethyl)pyrrolidin-1-ylsulfonyl)indoline-2,3-dione 1-[4-(2-fluoroethoxy)-benzyl]-5-(2-phenoxymethyl-pyrrolidine-1-sulfonyl)-1H-indole-2,3-dione | CHEMBL213759
Type:
Small organic molecule
Emp. Form.:
C28H27FN2O6S
Mol. Mass.:
538.587
SMILES:
FCCOc1ccc(CN2C(=O)C(=O)c3cc(ccc23)S(=O)(=O)N2CCC[C@H]2COc2ccccc2)cc1
: