Target
Caspase-8
Ligand
BDBM10305
Substrate
Meas. Tech.
ChEMBL_408845 (CHEMBL909400)
IC50
>500000±n/a nM
Citation
 Kopka, KFaust, AKeul, PWagner, SBreyholz, HJHöltke, CSchober, OSchäfers, MLevkau, B 5-pyrrolidinylsulfonyl isatins as a potential tool for the molecular imaging of caspases in apoptosis. J Med Chem 49:6704-15 (2006)  
Target
Name:
Caspase-8
Synonyms:
Apoptotic cysteine protease CAP4 CASP8 Caspase Caspase-8 subunit p18 FADD-like ICE ICE-like apoptotic protease 5 MCH5 | MORT1-associated CED-3 homolog
Type:
Enzyme
Mol. Mass.:
55373.89
Organism:
Homo sapiens (Human)
Description:
Q14790
Residue:
479
  
Inhibitor
Name:
BDBM10305
Synonyms:
(S)-5-[1-(2-Methoxymethyl)pyrrolidinylsulfonyl]isatin CHEMBL60190 | Isatin Sulfonamide 16
Type:
Small organic molecule
Emp. Form.:
C14H16N2O5S
Mol. Mass.:
324.352
SMILES:
COC[C@@H]1CCCN1S(=O)(=O)c1ccc2NC(=O)C(=O)c2c1
: