Target
Histamine H3 receptor
Ligand
BDBM50200644
Substrate
Meas. Tech.
ChEMBL_453774 (CHEMBL885775)
Ki
0.49±n/a nM
Citation
 Black, LANersesian, DLSharma, PKu, YYBennani, YLMarsh, KCMiller, TREsbenshade, TAHancock, AACowart, M 4-[6-(2-Aminoethyl)naphthalen-2-yl]benzonitriles are potent histamine H3 receptor antagonists with high CNS penetration. Bioorg Med Chem Lett 17:1443-6 (2007)  
Target
Name:
Histamine H3 receptor
Synonyms:
G-protein coupled receptor 97 HH3R HRH3 Histamine H3 receptor (H3) Histamine receptor (H3 and H4)
Type:
G Protein-Coupled Receptor (GPCR)
Mol. Mass.:
48691.47
Organism:
Homo sapiens (Human)
Description:
Binding assays were using CHO cells stably expressing hH3R receptors.
Residue:
445
  
Inhibitor
Name:
BDBM50200644
Synonyms:
4-(6-(2-(pyrrolidin-1-yl)ethyl)naphthalen-2-yl)benzonitrile | CHEMBL247702
Type:
Small organic molecule
Emp. Form.:
C23H22N2
Mol. Mass.:
326.4342
SMILES:
N#Cc1ccc(cc1)-c1ccc2cc(CCN3CCCC3)ccc2c1
: