Target
Histamine H3 receptor
Ligand
BDBM50200645
Substrate
Meas. Tech.
ChEMBL_453774 (CHEMBL885775)
Ki
27.3±n/a nM
Citation
 Black, LANersesian, DLSharma, PKu, YYBennani, YLMarsh, KCMiller, TREsbenshade, TAHancock, AACowart, M 4-[6-(2-Aminoethyl)naphthalen-2-yl]benzonitriles are potent histamine H3 receptor antagonists with high CNS penetration. Bioorg Med Chem Lett 17:1443-6 (2007)  
Target
Name:
Histamine H3 receptor
Synonyms:
G-protein coupled receptor 97 HH3R HRH3 Histamine H3 receptor (H3) Histamine receptor (H3 and H4)
Type:
G Protein-Coupled Receptor (GPCR)
Mol. Mass.:
48691.47
Organism:
Homo sapiens (Human)
Description:
Binding assays were using CHO cells stably expressing hH3R receptors.
Residue:
445
  
Inhibitor
Name:
BDBM50200645
Synonyms:
4-(6-(2-(2-isopropylpyrrolidin-1-yl)ethyl)naphthalen-2-yl)benzonitrile | CHEMBL248156
Type:
Small organic molecule
Emp. Form.:
C26H28N2
Mol. Mass.:
368.5139
SMILES:
CC(C)C1CCCN1CCc1ccc2cc(ccc2c1)-c1ccc(cc1)C#N
: