Target
Acetylcholinesterase
Ligand
BDBM29395
Substrate
Meas. Tech.
ChEMBL_422675 (CHEMBL913361)
IC50
600±n/a nM
Citation
 Marco-Contelles, JLeón, Rde Los Ríos, CGuglietta, ATerencio, JLópez, MGGarcía, AGVillarroya, M Novel multipotent tacrine-dihydropyridine hybrids with improved acetylcholinesterase inhibitory and neuroprotective activities as potential drugs for the treatment of Alzheimer's disease. J Med Chem 49:7607-10 (2006)  
Target
Name:
Acetylcholinesterase
Synonyms:
ACES_ELEEL Acetylcholinesterase (EeAChE) | ache
Type:
Enzyme
Mol. Mass.:
71812.79
Organism:
Electrophorus electricus (Electric eel)
Description:
Residue:
633
  
Inhibitor
Name:
BDBM29395
Synonyms:
CHEMBL219405 | tacrine-dihydropyridine hybrid (tacripyrine), 6
Type:
Small organic molecule
Emp. Form.:
C22H24N4O4
Mol. Mass.:
408.4504
SMILES:
CCOC(=O)C1C(c2ccc(cc2)[N+]([O-])=O)c2c(N)c3CCCCc3nc2N=C1C
: