Target
Proto-oncogene tyrosine-protein kinase Src
Ligand
BDBM50201231
Substrate
Meas. Tech.
ChEMBL_453858 (CHEMBL885860)
IC50
3900±n/a nM
Citation
 Boschelli, DHBarrios Sosa, ACGolas, JMBoschelli, F Inhibition of Src kinase activity by 7-ethynyl-4-phenylamino-3-quinolinecarbonitriles: identification of SKS-927. Bioorg Med Chem Lett 17:1358-61 (2007)  
Target
Name:
Proto-oncogene tyrosine-protein kinase Src
Synonyms:
Proto-oncogene c-Src Src p60-Src | pp60c-src
Type:
PROTEIN
Mol. Mass.:
59976.76
Organism:
Rattus norvegicus
Description:
ChEMBL_453858
Residue:
536
  
Inhibitor
Name:
BDBM50201231
Synonyms:
4-(2,4-dichloro-5-methoxyphenylamino)-6-(4-(4-methylpiperazin-1-yl)but-1-ynyl)quinoline-3-carbonitrile | CHEMBL393150
Type:
Small organic molecule
Emp. Form.:
C26H25Cl2N5O
Mol. Mass.:
494.416
SMILES:
COc1cc(Nc2c(cnc3ccc(cc23)C#CCCN2CCN(C)CC2)C#N)c(Cl)cc1Cl
: