Target
Muscarinic acetylcholine receptor M2
Ligand
BDBM50165019
Substrate
Meas. Tech.
ChEMBL_441417 (CHEMBL891646)
Ki
8.1±n/a nM
Citation
 Sonda, SKatayama, KFujio, MSakashita, HInaba, KAsano, KAkira, T 1,5-Benzodioxepin derivatives as a novel class of muscarinic M3 receptor antagonists. Bioorg Med Chem Lett 17:925-31 (2007)  
Target
Name:
Muscarinic acetylcholine receptor M2
Synonyms:
ACM2_HUMAN Cholinergic, muscarinic M2 Muscarinic acetylcholine receptor M2 and M5 | RecName: Full=Muscarinic acetylcholine receptor M2
Type:
GPCR
Mol. Mass.:
51730.61
Organism:
Homo sapiens (Human)
Description:
P08172
Residue:
466
  
Inhibitor
Name:
BDBM50165019
Synonyms:
4-(Diethylamino)-2-butynyl alpha-phenylcyclohexaneglycolic acid ester 4-Diethylamino-2-butinyl alpha-cyclohexylmandelat Benzeneacetic acid, alpha-cyclohexyl-alpha-hydroxy-, 4-(diethylamino)-2-butynyl ester Cyclohexaneglycolic acid, alpha-phenyl-, 4-(diethylamino)-2-butynyl ester | OXYBUTYNIN CHLORIDE
Type:
Small organic molecule
Emp. Form.:
C22H31NO3
Mol. Mass.:
357.4864
SMILES:
CCN(CC)CC#CCOC(=O)C(O)(C1CCCCC1)c1ccccc1
: