Target
Muscarinic acetylcholine receptor M3
Ligand
BDBM50201296
Substrate
Meas. Tech.
ChEMBL_441418 (CHEMBL891647)
Ki
2.9±n/a nM
Citation
 Sonda, SKatayama, KFujio, MSakashita, HInaba, KAsano, KAkira, T 1,5-Benzodioxepin derivatives as a novel class of muscarinic M3 receptor antagonists. Bioorg Med Chem Lett 17:925-31 (2007)  
Target
Name:
Muscarinic acetylcholine receptor M3
Synonyms:
ACM3_HUMAN Cholinergic, muscarinic M3 Muscarinic receptor M3 | RecName: Full=Muscarinic acetylcholine receptor M3
Type:
Enzyme
Mol. Mass.:
66151.03
Organism:
Homo sapiens (Human)
Description:
P20309
Residue:
590
  
Inhibitor
Name:
BDBM50201296
Synonyms:
4-(2-((3-(dimethylamino)-3,4-dihydro-2H-benzo[b][1,4]dioxepin-3-yl)methylamino)ethyl)cyclohexanol | CHEMBL391977
Type:
Small organic molecule
Emp. Form.:
C20H32N2O3
Mol. Mass.:
348.4797
SMILES:
CN(C)C1(CNCCC2CCC(O)CC2)COc2ccccc2OC1
: