Target
Vascular endothelial growth factor receptor 2
Ligand
BDBM4851
Substrate
Meas. Tech.
ChEMBL_453897 (CHEMBL885901)
IC50
21±n/a nM
Citation
 Kiselyov, ASPiatnitski, ELSamet, AVKisliy, VPSemenov, VV ortho-Substituted azoles as selective and dual inhibitors of VEGF receptors 1 and 2. Bioorg Med Chem Lett 17:1369-75 (2007)  
Target
Name:
Vascular endothelial growth factor receptor 2
Synonyms:
CD_antigen=CD309 Fetal liver kinase 1 (FLK-1) KDR Protein-tyrosine kinase receptor Flk-1 VEGFR-2 VEGFR2 Vascular Endothelial Growth Factor Receptor Kinase 2 Vascular endothelial growth factor receptor 2 (KDR) Vascular endothelial growth factor receptor 2 (VEGFR2) Vascular endothelial growth factor receptor-2 (VEGFR-2)
Type:
Receptor Tyrosine Kinase
Mol. Mass.:
151510.97
Organism:
Homo sapiens (Human)
Description:
P35968
Residue:
1356
  
Inhibitor
Name:
BDBM4851
Synonyms:
(4-chlorophenyl)-[4-(4-pyridylmethyl)phthalazin-1-yl]amine CGP 79787 CHEMBL75232 N-(4-chlorophenyl)-4-(pyridin-4-ylmethyl)phthalazin-1-amine PTK787 cid_151194
Type:
Small organic molecule
Emp. Form.:
C20H15ClN4
Mol. Mass.:
346.813
SMILES:
Clc1ccc(Nc2nnc(Cc3ccncc3)c3ccccc23)cc1
: