Target
Carboxypeptidase B
Ligand
BDBM50201429
Substrate
Meas. Tech.
ChEMBL_453905 (CHEMBL885909)
IC50
3.0±n/a nM
Citation
 Islam, IBryant, JMay, KMohan, RYuan, SKent, LMorser, JZhao, LVergona, RWhite, KAdler, MWhitlow, MBuckman, BO 3-Mercaptopropionic acids as efficacious inhibitors of activated thrombin activatable fibrinolysis inhibitor (TAFIa). Bioorg Med Chem Lett 17:1349-54 (2007)  
Target
Name:
Carboxypeptidase B
Synonyms:
CBPB1_PIG CPB1
Type:
PROTEIN
Mol. Mass.:
47371.10
Organism:
Sus scrofa
Description:
ChEMBL_453905
Residue:
416
  
Inhibitor
Name:
BDBM50201429
Synonyms:
2-(1-carbamimidoylpiperidin-3-yl)-3-mercaptopropanoic acid | CHEMBL245589
Type:
Small organic molecule
Emp. Form.:
C9H17N3O2S
Mol. Mass.:
231.315
SMILES:
NC(=N)N1CCCC(C1)C(CS)C(O)=O
: