Target
Carboxypeptidase B
Ligand
BDBM50201432
Substrate
Meas. Tech.
ChEMBL_453905 (CHEMBL885909)
IC50
1040±n/a nM
Citation
 Islam, IBryant, JMay, KMohan, RYuan, SKent, LMorser, JZhao, LVergona, RWhite, KAdler, MWhitlow, MBuckman, BO 3-Mercaptopropionic acids as efficacious inhibitors of activated thrombin activatable fibrinolysis inhibitor (TAFIa). Bioorg Med Chem Lett 17:1349-54 (2007)  
Target
Name:
Carboxypeptidase B
Synonyms:
CBPB1_PIG CPB1
Type:
PROTEIN
Mol. Mass.:
47371.10
Organism:
Sus scrofa
Description:
ChEMBL_453905
Residue:
416
  
Inhibitor
Name:
BDBM50201432
Synonyms:
2-(1-(1-iminoethyl)piperidin-4-yl)-3-mercaptopropanoic acid | CHEMBL245785
Type:
Small organic molecule
Emp. Form.:
C10H18N2O2S
Mol. Mass.:
230.327
SMILES:
CC(=N)N1CCC(CC1)C(CS)C(O)=O
: