Target
Carboxypeptidase N catalytic chain
Ligand
BDBM50201427
Substrate
Meas. Tech.
ChEMBL_453906 (CHEMBL885910)
IC50
8±n/a nM
Citation
 Islam, IBryant, JMay, KMohan, RYuan, SKent, LMorser, JZhao, LVergona, RWhite, KAdler, MWhitlow, MBuckman, BO 3-Mercaptopropionic acids as efficacious inhibitors of activated thrombin activatable fibrinolysis inhibitor (TAFIa). Bioorg Med Chem Lett 17:1349-54 (2007)  
Target
Name:
Carboxypeptidase N catalytic chain
Synonyms:
ACBP Arginine carboxypeptidase CPN Carboxypeptidase N catalytic chain Carboxypeptidase N small subunit Kininase-1 Plasma carboxypeptidase B Serum carboxypeptidase N
Type:
PROTEIN
Mol. Mass.:
52293.66
Organism:
Homo sapiens (Human)
Description:
ChEMBL_1496379
Residue:
458
  
Inhibitor
Name:
BDBM50201427
Synonyms:
2-(3-guanidinophenyl)-3-mercaptopropanoic acid | CHEMBL245787
Type:
Small organic molecule
Emp. Form.:
C10H13N3O2S
Mol. Mass.:
239.294
SMILES:
[#7]\[#6](-[#7])=[#7]\c1cccc(c1)-[#6](-[#6]-[#16])-[#6](-[#8])=O
: