Target
Metabotropic glutamate receptor 5
Ligand
BDBM50201496
Substrate
Meas. Tech.
ChEMBL_453909 (CHEMBL885913)
IC50
195±n/a nM
Citation
 Ceccarelli, SMJaeschke, GBuettelmann, BHuwyler, JKolczewski, SPeters, JUPrinssen, EPorter, RSpooren, WVieira, E Rational design, synthesis, and structure-activity relationship of benzoxazolones: new potent mglu5 receptor antagonists based on the fenobam structure. Bioorg Med Chem Lett 17:1302-6 (2007)  
Target
Name:
Metabotropic glutamate receptor 5
Synonyms:
GPRC1E GRM5_HUMAN metabotropic glutamate 5 | metabotropic glutamate 5a
Type:
Enzyme
Mol. Mass.:
132484.72
Organism:
Homo sapiens (Human)
Description:
Residue:
1212
  
Inhibitor
Name:
BDBM50201496
Synonyms:
CHEMBL239592 | N-(3-chlorophenyl)-2-oxo-2,3-dihydrobenzo[d]oxazole-4-carboxamide
Type:
Small organic molecule
Emp. Form.:
C14H9ClN2O3
Mol. Mass.:
288.686
SMILES:
Clc1cccc(NC(=O)c2cccc3oc(=O)[nH]c23)c1
: