Target
Metabotropic glutamate receptor 5
Ligand
BDBM50201669
Substrate
Meas. Tech.
ChEMBL_453952 (CHEMBL885956)
IC50
1020±n/a nM
Citation
 Jaeschke, GPorter, RBüttelmann, BCeccarelli, SMGuba, WKuhn, BKolczewski, SHuwyler, JMutel, VPeters, JUBallard, TPrinssen, EVieira, EWichmann, JSpooren, W Synthesis and biological evaluation of fenobam analogs as mGlu5 receptor antagonists. Bioorg Med Chem Lett 17:1307-11 (2007)  
Target
Name:
Metabotropic glutamate receptor 5
Synonyms:
GPRC1E GRM5_HUMAN metabotropic glutamate 5 | metabotropic glutamate 5a
Type:
Enzyme
Mol. Mass.:
132484.72
Organism:
Homo sapiens (Human)
Description:
Residue:
1212
  
Inhibitor
Name:
BDBM50201669
Synonyms:
2-(2-(4-chlorophenyl)ethynyl)-6-methylpyridine | CHEMBL394922
Type:
Small organic molecule
Emp. Form.:
C14H10ClN
Mol. Mass.:
227.689
SMILES:
Cc1cccc(n1)C#Cc1ccc(Cl)cc1
: