Target
A disintegrin and metalloproteinase with thrombospondin motifs 5
Ligand
BDBM50202152
Substrate
Meas. Tech.
ChEMBL_438214 (CHEMBL907607)
IC50
20100±n/a nM
Citation
 Bursavich, MGGilbert, AMLombardi, SGeorgiadis, KEReifenberg, EFlannery, CRMorris, EA Synthesis and evaluation of aryl thioxothiazolidinone inhibitors of ADAMTS-5 (Aggrecanase-2). Bioorg Med Chem Lett 17:1185-8 (2007)  
Target
Name:
A disintegrin and metalloproteinase with thrombospondin motifs 5
Synonyms:
A disintegrin and metalloproteinase with thrombospondin motifs 5 (ADAMTS-5) ADAMTS5 ATS5_HUMAN Metalloproteinase with thrombospondin motifs 5 (ADAMTS-5)
Type:
Enzyme
Mol. Mass.:
101769.09
Organism:
Homo sapiens (Human)
Description:
Q9UNA0
Residue:
930
  
Inhibitor
Name:
BDBM50202152
Synonyms:
5-(3-(benzyloxy)benzylidene)-2-thioxothiazolidin-4-one | CHEMBL230403
Type:
Small organic molecule
Emp. Form.:
C17H13NO2S2
Mol. Mass.:
327.421
SMILES:
SC1=NC(=O)C(S1)=Cc1cccc(OCc2ccccc2)c1
: