Target
Adenosine receptor A2a
Ligand
BDBM50202775
Substrate
Meas. Tech.
ChEMBL_454055 (CHEMBL903246)
Ki
0.1±n/a nM
Citation
 Silverman, LSCaldwell, JPGreenlee, WJKiselgof, EMatasi, JJTulshian, DBArik, LFoster, CBertorelli, RMonopoli, AOngini, E 3H-[1,2,4]-Triazolo[5,1-i]purin-5-amine derivatives as adenosine A2A antagonists. Bioorg Med Chem Lett 17:1659-62 (2007)  
Target
Name:
Adenosine receptor A2a
Synonyms:
A2A adenosine receptor (hA2A) ADENOSINE A2 ADORA2 Adenosine A2A receptor (A2AAR)
Type:
G Protein-Coupled Receptor (GPCR)
Mol. Mass.:
44716.46
Organism:
Homo sapiens (Human)
Description:
P29274
Residue:
412
  
Inhibitor
Name:
BDBM50202775
Synonyms:
8-(furan-2-yl)-3-(2-(4-(4-methoxyphenyl)piperazin-1-yl)ethyl)-3H-[1,2,4]triazolo[1,5-g]purin-5-amine | CHEMBL245848
Type:
Small organic molecule
Emp. Form.:
C23H25N9O2
Mol. Mass.:
459.5037
SMILES:
COc1ccc(cc1)N1CCN(CCn2cnc3c2nc(N)n2nc(nc32)-c2ccco2)CC1
: