Target
Vasopressin V1a receptor
Ligand
BDBM50202917
Substrate
Meas. Tech.
ChEMBL_441650 (CHEMBL891881)
IC50
2±n/a nM
Citation
 Guillon, CDKoppel, GABrownstein, MJChaney, MOFerris, CFLu, SFFabio, KMMiller, MJHeindel, NDHunden, DCCooper, RDKaldor, SWSkelton, JJDressman, BAClay, MPSteinberg, MIBruns, RFSimon, NG Azetidinones as vasopressin V1a antagonists. Bioorg Med Chem 15:2054-80 (2007)  
Target
Name:
Vasopressin V1a receptor
Synonyms:
AVPR V1a AVPR1A V1AR_HUMAN VASOPRESSIN V1A Vasopressin V1 receptor Vasopressin receptor
Type:
Receptor
Mol. Mass.:
46820.18
Organism:
Homo sapiens (Human)
Description:
P37288
Residue:
418
  
Inhibitor
Name:
BDBM50202917
Synonyms:
CHEMBL389581 | benzyl 2-((2R,3S)-2-((E)-2-(furan-2-yl)vinyl)-4-oxo-3-((S)-2-oxo-4-phenyloxazolidin-3-yl)azetidin-1-yl)-4,4-dimethyl-3-oxopentanoate
Type:
Small organic molecule
Emp. Form.:
C32H32N2O7
Mol. Mass.:
556.6057
SMILES:
CC(C)(C)C(=O)C(N1[C@H](\C=C\c2ccco2)[C@H](N2[C@H](COC2=O)c2ccccc2)C1=O)C(=O)OCc1ccccc1
: