Target
B2 bradykinin receptor
Ligand
BDBM50203198
Substrate
Meas. Tech.
ChEMBL_425212 (CHEMBL855158)
Ki
13300±n/a nM
Citation
 D'Amico, DCAya, THuman, JFotsch, CChen, JJBiswas, KRiahi, BNorman, MHWilloughby, CAHungate, RReider, PJBiddlecome, GLester-Zeiner, DStaden, CVJohnson, EKamassah, AArik, LWang, JViswanadhan, VNGroneberg, RDZhan, JSuzuki, HToro, AMareska, DAClarke, DEHarvey, DMBurgess, LELaird, ERAskew, BNg, G Identification of a nonpeptidic and conformationally restricted bradykinin B1 receptor antagonist with anti-inflammatory activity. J Med Chem 50:607-10 (2007)  
Target
Name:
B2 bradykinin receptor
Synonyms:
B2 BRADYKININ B2R BK-2 receptor BKRB2_HUMAN | Bradykinin B2 receptor
Type:
Enzyme Catalytic Domain
Mol. Mass.:
44467.17
Organism:
Homo sapiens (Human)
Description:
B2 BRADYKININ BDKRB2 HUMAN::P30411
Residue:
391
  
Inhibitor
Name:
BDBM50203198
Synonyms:
(R)-3-(naphthalene-7-sulfonamido)-3-phenyl-N-((S)-5-(piperidin-1-ylmethyl)-2,3-dihydro-1H-inden-1-yl)propanamide | CHEMBL414091
Type:
Small organic molecule
Emp. Form.:
C34H37N3O3S
Mol. Mass.:
567.741
SMILES:
O=C(C[C@@H](NS(=O)(=O)c1ccc2ccccc2c1)c1ccccc1)N[C@H]1CCc2cc(CN3CCCCC3)ccc12
: